Target
Tyrosine-protein kinase ABL1
Ligand
BDBM50357312
Substrate
Meas. Tech.
In Vitro HotSpot Kinase Assay
IC50
86.1±n/a nM
Citation
 Honigberg, LVerner, EBuggy, JLoury, DChen, W Inhibitors of bruton's tyrosine kinase for the treatment of solid tumors US Patent  US9278100 Publication Date 3/8/2016 
Target
Name:
Tyrosine-protein kinase ABL1
Synonyms:
ABL ABL1_HUMAN JTK7 Proto-oncogene tyrosine-protein kinase ABL1 Tyrosine-protein kinase ABL V-abl Abelson murine leukemia viral oncogene homolog 1 p150 | tyrosine-protein kinase ABL1 isoform a
Type:
Enzyme
Mol. Mass.:
122897.30
Organism:
Homo sapiens (Human)
Description:
P00519
Residue:
1130
  
Inhibitor
Name:
BDBM50357312
Synonyms:
IBRUTINIB US10124003, Ref. Ex. Compound 1 US10793575, Example ibrutinib US10919899, Ibrutinib US11186578, Example Ibrutinib US11407754, Example Ibrutinib US9108973, Ref 1 US9278100, 1
Type:
Small organic molecule
Emp. Form.:
C25H24N6O2
Mol. Mass.:
440.4971
SMILES:
Nc1ncnc2n(nc(-c3ccc(Oc4ccccc4)cc3)c12)[C@@H]1CCCN(C1)C(=O)C=C
: