Target
Tyrosine-protein kinase JAK3
Ligand
BDBM191605
Substrate
Meas. Tech.
In Vitro HotSpot Kinase Assay
IC50
1456±n/a nM
Citation
 Honigberg, LVerner, EBuggy, JLoury, DChen, W Inhibitors of bruton's tyrosine kinase for the treatment of solid tumors US Patent  US9278100 Publication Date 3/8/2016 
Target
Name:
Tyrosine-protein kinase JAK3
Synonyms:
JAK-3 JAK3_HUMAN Janus kinase 3 (JAK3) L-JAK | Leukocyte janus kinase
Type:
Protein
Mol. Mass.:
125111.08
Organism:
Homo sapiens (Human)
Description:
P52333
Residue:
1124
  
Inhibitor
Name:
BDBM191605
Synonyms:
US9181263, 14 | US9278100, 14
Type:
Small organic molecule
Emp. Form.:
C25H24N6O2
Mol. Mass.:
440.4971
SMILES:
Nc1ncnc2n(C[C@@H]3CCCN3C(=O)C=C)nc(-c3ccc(Oc4ccccc4)cc3)c12
: