Target
Isoform Alpha-4-2 of Neuronal acetylcholine receptor subunit alpha-4 (Alpha-4-2)/Neuronal acetylcholine receptor subunit beta-2
Ligand
BDBM221040
Substrate
Meas. Tech.
[3H]Epibatidine Binding Assay
pH
7.4±n/a
Temperature
298.15±n/a K
Ki
0.12±0.03 nM
Comments
extracted
Citation
 Carroll, FIOndachi, PW Nicotinic receptor compounds US Patent  US9284322 Publication Date 3/15/2016 
Target
Name:
Isoform Alpha-4-2 of Neuronal acetylcholine receptor subunit alpha-4 (Alpha-4-2)/Neuronal acetylcholine receptor subunit beta-2
Synonyms:
Neuronal acetylcholine receptor subunit alpha-4 (Alpha-4-2)/beta-2 | nAChR alpha4 beta2 subtype
Type:
Enzyme
Mol. Mass.:
Description:
Components:
This complex has 2 components.
Component 1
Name:
Isoform Alpha-4-2 of Neuronal acetylcholine receptor subunit alpha-4 (Alpha-4-2)
Synonyms:
ACHA4_RAT Chrna4 Neuronal acetylcholine receptor subunit alpha-4 (Alpha-4-2) | Neuronal acetylcholine receptor subunit alpha-4 beta 2
Type:
Enzyme
Mol. Mass.:
70323.63
Organism:
Rattus norvegicus (Rat)
Description:
P09483-2
Residue:
631
  
Component 2
Name:
Neuronal acetylcholine receptor subunit beta-2
Synonyms:
ACHB2_RAT Chrnb2 Neuronal acetylcholine receptor non-alpha-1 chain
Type:
Enzyme
Mol. Mass.:
56910.32
Organism:
Rattus norvegicus (Rat)
Description:
P12390
Residue:
500
  
Inhibitor
Name:
BDBM221040
Synonyms:
US9284322, Table 6, Compound 6
Type:
Small organic molecule
Emp. Form.:
C16H16FN3
Mol. Mass.:
269.3167
SMILES:
Fc1ncc(cc1-c1ccncc1)C1CC2CCC1N2
: