Target
Isoform 2 of Nuclear receptor ROR-gamma (RORgT)
Ligand
BDBM220318
Substrate
Meas. Tech.
ThermoFluor® Assay
pH
7±n/a
Temperature
274.15±n/a K
Kd
1100±n/a nM
Comments
extracted
Citation
 Leonard, KABarbay, KEdwards, JPKreutter, KDKummer, DAMaharoof, UNishimura, RUrbanski, MVenkatesan, HWang, AWolin, RLWoods, CRPierce, JGoldberg, SFourie, AXue, X Methylene linked quinolinyl modulators of RORγt US Patent  US9290476 Publication Date 3/22/2016 
Target
Name:
Isoform 2 of Nuclear receptor ROR-gamma (RORgT)
Synonyms:
Isoform 2 of Nuclear receptor ROR-gamma Nuclear receptor ROR-gamma (RORgT) RORC RORG_HUMAN Retinoid-related orphan receptor-gamma (RORgT) | Retinoid-related orphan receptor-gamma (RORĪ³T)
Type:
Protein
Mol. Mass.:
55831.73
Organism:
Homo sapiens (Human)
Description:
P51449-2
Residue:
497
  
Inhibitor
Name:
BDBM220318
Synonyms:
US9290476, 70B | US9290476, 70C
Type:
Small organic molecule
Emp. Form.:
C31H22F3N7O
Mol. Mass.:
565.5479
SMILES:
Cn1cncc1C(O)(c1ccc(nc1)C(F)(F)F)c1ccc2nc(C#N)c(Cc3ccc(cc3)-n3cccn3)cc2c1
: