Target
Isoform 2 of Nuclear receptor ROR-gamma (RORgT)
Ligand
BDBM50058935
Substrate
Meas. Tech.
ThermoFluor® Assay
pH
7±n/a
Temperature
274.15±n/a K
Kd
0.024±n/a nM
Comments
extracted
Citation
 Leonard, KABarbay, KEdwards, JPKreutter, KDKummer, DAMaharoof, UNishimura, RUrbanski, MVenkatesan, HWang, AWolin, RLWoods, CRPierce, JGoldberg, SFourie, AXue, X Methylene linked quinolinyl modulators of RORγt US Patent  US9290476 Publication Date 3/22/2016 
Target
Name:
Isoform 2 of Nuclear receptor ROR-gamma (RORgT)
Synonyms:
Isoform 2 of Nuclear receptor ROR-gamma Nuclear receptor ROR-gamma (RORgT) RORC RORG_HUMAN Retinoid-related orphan receptor-gamma (RORgT) | Retinoid-related orphan receptor-gamma (RORĪ³T)
Type:
Protein
Mol. Mass.:
55831.73
Organism:
Homo sapiens (Human)
Description:
P51449-2
Residue:
497
  
Inhibitor
Name:
BDBM50058935
Synonyms:
CHEMBL3358455 | US9290476, 79C
Type:
Small organic molecule
Emp. Form.:
C27H23ClF3N5O2S
Mol. Mass.:
574.017
SMILES:
COc1nc2ccc(cc2c(Cl)c1Cc1ccc(cc1)C(F)(F)F)C(O)(c1cnnn1C)c1sc(C)nc1C
: