Target
Opioid growth factor receptor-like protein 1
Ligand
BDBM220367
Substrate
Meas. Tech.
In Vitro ORL-1 Receptor Binding Assay
pH
7.4±n/a
Temperature
298.15±n/a K
Ki
294±63 nM
Comments
extracted
Citation
 Tafesse, LTsuno, NZhou, X Azetidine-substituted quinoxalines as opioid receptor like-1 modulators US Patent  US9290488 Publication Date 3/22/2016 
Target
Name:
Opioid growth factor receptor-like protein 1
Synonyms:
OGFRL1 Opioid Receptor-Like Receptor (ORL-1) Opioid growth factor receptor-like protein 1 (ORL1) Opioid receptor-like (ORL1) Opioid receptor-like receptor (ORL1)
Type:
Protein
Mol. Mass.:
51247.53
Organism:
Homo sapiens (Human)
Description:
Q5TC84
Residue:
451
  
Inhibitor
Name:
BDBM220367
Synonyms:
US9290488, C2a(ii)
Type:
Small organic molecule
Emp. Form.:
C28H36N4O4
Mol. Mass.:
492.6098
SMILES:
OC(=O)[C@@H]1CCN1c1nc2ccccc2n([C@@H]2C[C@@H]3COC[C@H](C2)N3[C@@H]2C[C@H]3CCC[C@H](C3)C2)c1=O
: