Target
Kappa-type opioid receptor
Ligand
BDBM220377
Substrate
Meas. Tech.
In Vitro Kappa-Opioid Receptor Binding Assay
pH
7.4±n/a
Temperature
298.15±n/a K
Ki
188±77 nM
Comments
extracted
Citation
 Tafesse, LTsuno, NZhou, X Azetidine-substituted quinoxalines as opioid receptor like-1 modulators US Patent  US9290488 Publication Date 3/22/2016 
Target
Name:
Kappa-type opioid receptor
Synonyms:
K-OR-1 Kappa-opioid receptor (KOR) Kappa-type opioid receptor (KOR) OPIATE Kappa OPRK1 kappa opioid receptor (KOR)
Type:
G Protein-Coupled Receptor (GPCR)
Mol. Mass.:
42648.76
Organism:
Homo sapiens (Human)
Description:
P41145
Residue:
380
  
Inhibitor
Name:
BDBM220377
Synonyms:
US9290488, L2b(i)
Type:
Small organic molecule
Emp. Form.:
C30H40N4O3
Mol. Mass.:
504.6636
SMILES:
OC(=O)[C@H]1CCN1c1nc2ccccc2n([C@@H]2C[C@@H]3CCC[C@H](C2)N3[C@H]2C[C@@H]3C[C@H](C2)CCCC3)c1=O
: