Target
Delta-type opioid receptor
Ligand
BDBM220372
Substrate
Meas. Tech.
In Vitro Delta-Opioid Receptor Binding Assay
pH
7.4±n/a
Temperature
298.15±n/a K
Ki
4860±150 nM
Comments
extracted
Citation
 Tafesse, LTsuno, NZhou, X Azetidine-substituted quinoxalines as opioid receptor like-1 modulators US Patent  US9290488 Publication Date 3/22/2016 
Target
Name:
Delta-type opioid receptor
Synonyms:
D-OR-1 Delta opioid receptor OPIATE Delta OPRD1 OPRK1 | opioid receptor, delta 1
Type:
G Protein-Coupled Receptor (GPCR)
Mol. Mass.:
40382.98
Organism:
Homo sapiens (Human)
Description:
Competition binding assays were carried out using membrane preparations from transfected HN9.10 cells that constitutively expressed the delta opioid receptor.
Residue:
372
  
Inhibitor
Name:
BDBM220372
Synonyms:
US9290488, E53a(ii)
Type:
Small organic molecule
Emp. Form.:
C31H42N4O3
Mol. Mass.:
518.6902
SMILES:
CC1(C)[C@@H]2C[C@H]1[C@H](CCN1[C@H]3CCC[C@@H]1C[C@@H](C3)n1c3ccccc3nc(N3CC[C@H]3C(O)=O)c1=O)CC2
: