Target
Opioid growth factor receptor-like protein 1
Ligand
BDBM220363
Substrate
Meas. Tech.
In Vitro ORL-1 Receptor Functional Assay
pH
7.4±n/a
Temperature
298.15±n/a K
EC50
2.62±0.18 nM
Comments
extracted
Citation
 Tafesse, LTsuno, NZhou, X Azetidine-substituted quinoxalines as opioid receptor like-1 modulators US Patent  US9290488 Publication Date 3/22/2016 
Target
Name:
Opioid growth factor receptor-like protein 1
Synonyms:
OGFRL1 Opioid Receptor-Like Receptor (ORL-1) Opioid growth factor receptor-like protein 1 (ORL1) Opioid receptor-like (ORL1) Opioid receptor-like receptor (ORL1)
Type:
Protein
Mol. Mass.:
51247.53
Organism:
Homo sapiens (Human)
Description:
Q5TC84
Residue:
451
  
Inhibitor
Name:
BDBM220363
Synonyms:
US9290488, B20a(i)
Type:
Small organic molecule
Emp. Form.:
C31H40N4O3
Mol. Mass.:
516.6743
SMILES:
CC12C[C@@H]3C[C@H]1C[C@H]2C[C@@H](C3)N1[C@H]2CCC[C@@H]1C[C@@H](C2)n1c2ccccc2nc(N2CC[C@@H]2C(O)=O)c1=O
: