Target
Mu-type opioid receptor
Ligand
BDBM220362
Substrate
Meas. Tech.
In Vitro Mu-Opioid Receptor Functional Assay
pH
7.4±n/a
Temperature
298.15±n/a K
EC50
>20000±n/a nM
Comments
extracted
Citation
 Tafesse, LTsuno, NZhou, X Azetidine-substituted quinoxalines as opioid receptor like-1 modulators US Patent  US9290488 Publication Date 3/22/2016 
Target
Name:
Mu-type opioid receptor
Synonyms:
M-OR-1 MOR-1 MUOR1 Mu opiate receptor OPRM1 hMOP | mu-type opioid receptor isoform MOR-1
Type:
G Protein-Coupled Receptor (GPCR)
Mol. Mass.:
44789.51
Organism:
Homo sapiens (Human)
Description:
P35372
Residue:
400
  
Inhibitor
Name:
BDBM220362
Synonyms:
US9290488, B12a
Type:
Small organic molecule
Emp. Form.:
C30H40N4O3
Mol. Mass.:
504.6636
SMILES:
C[C@H]1C[C@H]2C[C@@H](C1)C[C@@H](C2)N1[C@H]2CCC[C@@H]1C[C@@H](C2)n1c2ccccc2nc(N2CC(C2)C(O)=O)c1=O
: