Target
Bromodomain-containing protein 4 [352-457]
Ligand
BDBM220431
Substrate
Meas. Tech.
Bromodomain Domain Binding Assay
pH
6±n/a
Temperature
298.15±n/a K
Ki
0.68±n/a nM
Comments
extracted
Citation
 Wang, LPratt, JKMcDaniel, KFDai, YFidanze, SDHasvold, LHolms, JHKati, WMLiu, DMantei, RAMcClellan, WJSheppard, GSWada, CK Bromodomain inhibitors US Patent  US9296741 Publication Date 3/29/2016 
Target
Name:
Bromodomain-containing protein 4 [352-457]
Synonyms:
BRD4 Bromodomain-containing protein 4 (BRD4) Bromodomain-containing protein 4 (BRD4-BD2) | HUNK1
Type:
Enzyme Catalytic Domain
Mol. Mass.:
12432.37
Organism:
Homo sapiens (Human)
Description:
BDII: amino acid E352-M457
Residue:
106
  
Inhibitor
Name:
BDBM220431
Synonyms:
US10633379, Compound Z | US9296741, 20
Type:
Small organic molecule
Emp. Form.:
C21H18N2O3
Mol. Mass.:
346.3792
SMILES:
Cn1cc(-c2cc(CO)ccc2Oc2ccccc2)c2cc[nH]c2c1=O
: