Target
Bromodomain-containing protein 4 [352-457]
Ligand
BDBM220473
Substrate
Meas. Tech.
Bromodomain Domain Binding Assay
pH
6±n/a
Temperature
298.15±n/a K
Ki
1.9±n/a nM
Comments
extracted
Citation
 Wang, LPratt, JKMcDaniel, KFDai, YFidanze, SDHasvold, LHolms, JHKati, WMLiu, DMantei, RAMcClellan, WJSheppard, GSWada, CK Bromodomain inhibitors US Patent  US9296741 Publication Date 3/29/2016 
Target
Name:
Bromodomain-containing protein 4 [352-457]
Synonyms:
BRD4 Bromodomain-containing protein 4 (BRD4) Bromodomain-containing protein 4 (BRD4-BD2) | HUNK1
Type:
Enzyme Catalytic Domain
Mol. Mass.:
12432.37
Organism:
Homo sapiens (Human)
Description:
BDII: amino acid E352-M457
Residue:
106
  
Inhibitor
Name:
BDBM220473
Synonyms:
US9296741, 62
Type:
Small organic molecule
Emp. Form.:
C22H18F3N3O4S
Mol. Mass.:
477.456
SMILES:
CCS(=O)(=O)Nc1ccc(Oc2c(F)cc(F)cc2F)c(c1)-c1cn(C)c(=O)c2[nH]ccc12
: