Target
Bromodomain-containing protein 4 [352-457]
Ligand
BDBM220618
Substrate
Meas. Tech.
Bromodomain Domain Binding Assay
pH
6±n/a
Temperature
298.15±n/a K
Ki
1.8±n/a nM
Comments
extracted
Citation
 Wang, LPratt, JKMcDaniel, KFDai, YFidanze, SDHasvold, LHolms, JHKati, WMLiu, DMantei, RAMcClellan, WJSheppard, GSWada, CK Bromodomain inhibitors US Patent  US9296741 Publication Date 3/29/2016 
Target
Name:
Bromodomain-containing protein 4 [352-457]
Synonyms:
BRD4 Bromodomain-containing protein 4 (BRD4) Bromodomain-containing protein 4 (BRD4-BD2) | HUNK1
Type:
Enzyme Catalytic Domain
Mol. Mass.:
12432.37
Organism:
Homo sapiens (Human)
Description:
BDII: amino acid E352-M457
Residue:
106
  
Inhibitor
Name:
BDBM220618
Synonyms:
US9296741, 207
Type:
Small organic molecule
Emp. Form.:
C17H18N4O4S
Mol. Mass.:
374.414
SMILES:
Cn1cc(-c2cc(cnc2OCC2CC2)S(N)(=O)=O)c2cc[nH]c2c1=O
: