Target
Beta-secretase 1
Ligand
BDBM220790
Substrate
Meas. Tech.
Fluorescence Resonance Energy Transfer (FRET) Assay
pH
4.2±n/a
IC50
913.5±n/a nM
Comments
extracted
Citation
 White, RCheng, YMinatti, AEYang, BZheng, XMLopez, PHuman, JBEpstein, OJudd, TSham, KXue, Q Amino-oxazine and amino-dihydrothiazine compounds as beta-secretase modulators and methods of use US Patent  US9296759 Publication Date 3/29/2016 
Target
Name:
Beta-secretase 1
Synonyms:
ASP2 Aspartyl protease 2 BACE1 Beta-secretase (BACE) Beta-secretase 1 (BACE 1) Beta-secretase 1 (BACE1) Beta-site amyloid precursor protein cleaving enzyme 1 Memapsin-2 beta-Secretase (BACE-1) | beta-Secretase (BACE1)
Type:
Protein
Mol. Mass.:
55755.10
Organism:
Homo sapiens (Human)
Description:
P56817
Residue:
501
  
Inhibitor
Name:
BDBM220790
Synonyms:
US9296759, 55 | US9296759, 56
Type:
Small organic molecule
Emp. Form.:
C21H16ClFN6O3S
Mol. Mass.:
486.907
SMILES:
COc1cnc(cn1)C(=O)Nc1ccc2Oc3c(F)nc(Cl)cc3C3(CCSC(N)=N3)c2c1
: