Target
Beta-secretase 1
Ligand
BDBM220766
Substrate
Meas. Tech.
Fluorescence Resonance Energy Transfer (FRET) Assay
pH
4.2±n/a
IC50
9.4±n/a nM
Comments
extracted
Citation
 White, RCheng, YMinatti, AEYang, BZheng, XMLopez, PHuman, JBEpstein, OJudd, TSham, KXue, Q Amino-oxazine and amino-dihydrothiazine compounds as beta-secretase modulators and methods of use US Patent  US9296759 Publication Date 3/29/2016 
Target
Name:
Beta-secretase 1
Synonyms:
ASP2 Aspartyl protease 2 BACE1 Beta-secretase (BACE) Beta-secretase 1 (BACE 1) Beta-secretase 1 (BACE1) Beta-site amyloid precursor protein cleaving enzyme 1 Memapsin-2 beta-Secretase (BACE-1) | beta-Secretase (BACE1)
Type:
Protein
Mol. Mass.:
55755.10
Organism:
Homo sapiens (Human)
Description:
P56817
Residue:
501
  
Inhibitor
Name:
BDBM220766
Synonyms:
US9296759, 58
Type:
Small organic molecule
Emp. Form.:
C26H24N6O5
Mol. Mass.:
500.506
SMILES:
COc1cnc(cn1)C(=O)Nc1ccc2Oc3cnc(cc3[C@]3(CCOC(N)=N3)c2c1)C1=CCCOC1
: