Target
Cathepsin D
Ligand
BDBM220774
Substrate
Meas. Tech.
Fluorescence Resonance Energy Transfer (FRET) Assay
pH
3.5±n/a
IC50
334900±n/a nM
Comments
extracted
Citation
 White, RCheng, YMinatti, AEYang, BZheng, XMLopez, PHuman, JBEpstein, OJudd, TSham, KXue, Q Amino-oxazine and amino-dihydrothiazine compounds as beta-secretase modulators and methods of use US Patent  US9296759 Publication Date 3/29/2016 
Target
Name:
Cathepsin D
Synonyms:
CATD_HUMAN CTSD Cathepsin D heavy chain Cathepsin D precursor
Type:
Enzyme
Mol. Mass.:
44551.72
Organism:
Homo sapiens (Human)
Description:
Human proCathepsin D (SwissProt accession number P07339) was expressed in Sf9 cells, purified, and autoactivated.
Residue:
412
  
Inhibitor
Name:
BDBM220774
Synonyms:
US9296759, 47
Type:
Small organic molecule
Emp. Form.:
C21H16ClFN6O4
Mol. Mass.:
470.841
SMILES:
COc1cnc(cn1)C(=O)Nc1ccc2Oc3c(F)nc(Cl)cc3C3(CCOC(N)=N3)c2c1
: