Target
Cathepsin D
Ligand
BDBM220830
Substrate
Meas. Tech.
Fluorescence Resonance Energy Transfer (FRET) Assay
pH
3.5±n/a
IC50
400000±n/a nM
Comments
extracted
Citation
 White, RCheng, YMinatti, AEYang, BZheng, XMLopez, PHuman, JBEpstein, OJudd, TSham, KXue, Q Amino-oxazine and amino-dihydrothiazine compounds as beta-secretase modulators and methods of use US Patent  US9296759 Publication Date 3/29/2016 
Target
Name:
Cathepsin D
Synonyms:
CATD_HUMAN CTSD Cathepsin D heavy chain Cathepsin D precursor
Type:
Enzyme
Mol. Mass.:
44551.72
Organism:
Homo sapiens (Human)
Description:
Human proCathepsin D (SwissProt accession number P07339) was expressed in Sf9 cells, purified, and autoactivated.
Residue:
412
  
Inhibitor
Name:
BDBM220830
Synonyms:
US9296759, 62
Type:
Small organic molecule
Emp. Form.:
C27H24ClN5O5
Mol. Mass.:
533.963
SMILES:
COc1nc(cc2c1Oc1ccc(NC(=O)c3ccc(Cl)cn3)cc1C21CCOC(N)=N1)C1=CCOCC1
: