Target
Cathepsin D
Ligand
BDBM220855
Substrate
Meas. Tech.
Fluorescence Resonance Energy Transfer (FRET) Assay
pH
3.5±n/a
IC50
400000±n/a nM
Comments
extracted
Citation
 White, RCheng, YMinatti, AEYang, BZheng, XMLopez, PHuman, JBEpstein, OJudd, TSham, KXue, Q Amino-oxazine and amino-dihydrothiazine compounds as beta-secretase modulators and methods of use US Patent  US9296759 Publication Date 3/29/2016 
Target
Name:
Cathepsin D
Synonyms:
CATD_HUMAN CTSD Cathepsin D heavy chain Cathepsin D precursor
Type:
Enzyme
Mol. Mass.:
44551.72
Organism:
Homo sapiens (Human)
Description:
Human proCathepsin D (SwissProt accession number P07339) was expressed in Sf9 cells, purified, and autoactivated.
Residue:
412
  
Inhibitor
Name:
BDBM220855
Synonyms:
US9296759, 118
Type:
Small organic molecule
Emp. Form.:
C26H17F3N6O2S
Mol. Mass.:
534.512
SMILES:
NC1=NC2(CCS1)c1cc(NC(=O)c3ccc(F)cn3)ccc1Oc1c(F)nc(cc21)-c1ccnc(F)c1
: