Target
Arginase-1
Ligand
BDBM290374
Substrate
Meas. Tech.
Inhibition Assay of Arginase
pH
7.4±n/a
Temperature
298.15±n/a K
IC50
>5000±n/a nM
Comments
extracted
Citation
 Van Zandt, MJagdmann, GE Arginase inhibitors as therapeutics US Patent  US10098902 Publication Date 10/16/2018 
Target
Name:
Arginase-1
Synonyms:
ARG1 Liver-type arginase | Type I arginase
Type:
PROTEIN
Mol. Mass.:
34737.53
Organism:
Homo sapiens (Human)
Description:
ChEMBL_978893
Residue:
322
  
Inhibitor
Name:
BDBM290374
Synonyms:
(2R,3S)-3-amino-2-(3-boronopropyl)pyrrolidine-3-carboxylic acid US10603330, Example 10 | US11389464, Example 10
Type:
Small organic molecule
Emp. Form.:
C8H17BN2O4
Mol. Mass.:
216.043
SMILES:
N[C@]1(CCN[C@@H]1CCCB(O)O)C(O)=O
: