Target
Arginase-2, mitochondrial
Ligand
BDBM290400
Substrate
Meas. Tech.
Inhibition Assay of Arginase
pH
7.4±n/a
Temperature
298.15±n/a K
IC50
625±n/a nM
Comments
extracted
Citation
 Van Zandt, MJagdmann, GE Arginase inhibitors as therapeutics US Patent  US10098902 Publication Date 10/16/2018 
Target
Name:
Arginase-2, mitochondrial
Synonyms:
ARG2 Arginase II Non-hepatic arginase | Type II arginase
Type:
PROTEIN
Mol. Mass.:
38576.93
Organism:
Homo sapiens (Human)
Description:
ChEMBL_978892
Residue:
354
  
Inhibitor
Name:
BDBM290400
Synonyms:
(3R,4S)-3-amino-4-(3-boronopropyl)-1-((1-methylpiperidin-2- yl)methyl)pyrrolidine-3-carboxylic acid US10603330, Example 36 | US11389464, Example 36
Type:
Small organic molecule
Emp. Form.:
C15H30BN3O4
Mol. Mass.:
327.227
SMILES:
CN1CCCCC1CN1C[C@H](CCCB(O)O)[C@@](N)(C1)C(O)=O
: