Target
Arginase-2, mitochondrial
Ligand
BDBM290426
Substrate
Meas. Tech.
Inhibition Assay of Arginase
pH
7.4±n/a
Temperature
298.15±n/a K
IC50
<250±n/a nM
Comments
extracted
Citation
 Van Zandt, MJagdmann, GE Arginase inhibitors as therapeutics US Patent  US10098902 Publication Date 10/16/2018 
Target
Name:
Arginase-2, mitochondrial
Synonyms:
ARG2 Arginase II Non-hepatic arginase | Type II arginase
Type:
PROTEIN
Mol. Mass.:
38576.93
Organism:
Homo sapiens (Human)
Description:
ChEMBL_978892
Residue:
354
  
Inhibitor
Name:
BDBM290426
Synonyms:
(1S,2S,4S)-1-amino-4-(benzylamino)-2-(3- boronopropyl)cyclopentanecarboxylic acid US10603330, Example 62 | US11389464, Example 62
Type:
Small organic molecule
Emp. Form.:
C16H25BN2O4
Mol. Mass.:
320.192
SMILES:
N[C@]1(C[C@H](C[C@@H]1CCCB(O)O)NCc1ccccc1)C(O)=O
: