Target
Amine oxidase [flavin-containing] B
Ligand
BDBM220863
Substrate
US9302986, benzylamine
Meas. Tech.
MAO-B Inhibition Assay
pH
7.4±n/a
Temperature
310.15±n/a K
IC50
>1000±n/a nM
Comments
extracted
Citation
 Deodhar, MFindlay, ADFoot, JSJarolimek, WMcdonald, IARobertson, ADTurner, CI Substituted 3-haloallylamine inhibitors of ASSAO and uses thereof US Patent  US9302986 Publication Date 4/5/2016 
Target
Name:
Amine oxidase [flavin-containing] B
Synonyms:
AOFB_HUMAN MAOB Monoamine oxidase type B (MAO B) Monoamine oxidase type B (MAOB)
Type:
Protein
Mol. Mass.:
58768.76
Organism:
Homo sapiens (Human)
Description:
P27338
Residue:
520
  
Inhibitor
Name:
BDBM220863
Synonyms:
US9302986, 20
Type:
Small organic molecule
Emp. Form.:
C13H16BrFN2O2
Mol. Mass.:
331.181
SMILES:
CN(C)C(=O)c1ccc(OC\C(CN)=C/F)c(Br)c1
:
Substrate
Name:
BDBM10999
Synonyms:
Benzenemethanamine CHEMBL522 phenylmethanamine
Type:
Small organic molecule
Emp. Form.:
C7H9N
Mol. Mass.:
107.1531
SMILES:
NCc1ccccc1
: