Target
Membrane primary amine oxidase
Ligand
BDBM220884
Substrate
US9302986, benzylamine
Meas. Tech.
Recombinant SSAO/VAP-1 Inhibtion Assay
pH
7.4±n/a
IC50
<100000±n/a nM
Comments
extracted
Citation
 Deodhar, MFindlay, ADFoot, JSJarolimek, WMcdonald, IARobertson, ADTurner, CI Substituted 3-haloallylamine inhibitors of ASSAO and uses thereof US Patent  US9302986 Publication Date 4/5/2016 
Target
Name:
Membrane primary amine oxidase
Synonyms:
AOC3 Amine oxidase, copper containing Semicarbazide-sensitive amine oxidase/ Vascular adhesion protein 1 (SSAO/VAP-1) Vascular adhesion protein 1 (VAP-1)
Type:
Protein
Mol. Mass.:
84620.86
Organism:
Homo sapiens (Human)
Description:
Q16853
Residue:
763
  
Inhibitor
Name:
BDBM220884
Synonyms:
US9302986, 18
Type:
Small organic molecule
Emp. Form.:
C13H17FN2O2
Mol. Mass.:
252.2847
SMILES:
CN(C)C(=O)c1ccc(OC\C(CN)=C/F)cc1
:
Substrate
Name:
BDBM10999
Synonyms:
Benzenemethanamine CHEMBL522 phenylmethanamine
Type:
Small organic molecule
Emp. Form.:
C7H9N
Mol. Mass.:
107.1531
SMILES:
NCc1ccccc1
: