Target
Membrane primary amine oxidase
Ligand
BDBM220866
Substrate
US9302986, benzylamine
Meas. Tech.
Recombinant SSAO/VAP-1 Inhibition Assay in Rat Fat
pH
7.4±n/a
IC50
<100000±n/a nM
Comments
extracted
Citation
 Deodhar, MFindlay, ADFoot, JSJarolimek, WMcdonald, IARobertson, ADTurner, CI Substituted 3-haloallylamine inhibitors of ASSAO and uses thereof US Patent  US9302986 Publication Date 4/5/2016 
Target
Name:
Membrane primary amine oxidase
Synonyms:
AOC3_RAT Aoc3 Vascular adhesion protein 1 (VAP-1)
Type:
Enzyme
Mol. Mass.:
84979.78
Organism:
Rattus norvegicus (Rat)
Description:
O08590
Residue:
763
  
Inhibitor
Name:
BDBM220866
Synonyms:
US11472769, Compound BI-1467335-(PXS-4728A) | US9302986, 23
Type:
Small organic molecule
Emp. Form.:
C15H21FN2O2
Mol. Mass.:
280.3378
SMILES:
CC(C)(C)NC(=O)c1ccc(OC\C(CN)=C\F)cc1
:
Substrate
Name:
BDBM10999
Synonyms:
Benzenemethanamine CHEMBL522 phenylmethanamine
Type:
Small organic molecule
Emp. Form.:
C7H9N
Mol. Mass.:
107.1531
SMILES:
NCc1ccccc1
: