Target
Amiloride-sensitive amine oxidase [copper-containing]
Ligand
BDBM50246766
Substrate
US9302986, benzylamine
Meas. Tech.
DAO Inhibition Assay
pH
7.4±n/a
Temperature
310.15±n/a K
IC50
>10000±n/a nM
Comments
extracted
Citation
 Deodhar, MFindlay, ADFoot, JSJarolimek, WMcdonald, IARobertson, ADTurner, CI Substituted 3-haloallylamine inhibitors of ASSAO and uses thereof US Patent  US9302986 Publication Date 4/5/2016 
Target
Name:
Amiloride-sensitive amine oxidase [copper-containing]
Synonyms:
ABP AOC1 Amiloride-binding protein DAO1 Diamine oxidase (DAO) KAO | Kidney amine oxidase
Type:
Protein
Mol. Mass.:
85387.64
Organism:
Homo sapiens (Human)
Description:
P19801
Residue:
751
  
Inhibitor
Name:
BDBM50246766
Synonyms:
CHEMBL489079 US9302986, Mofegiline
Type:
Small organic molecule
Emp. Form.:
C11H13F2N
Mol. Mass.:
197.2244
SMILES:
NC\C(CCc1ccc(F)cc1)=C\F
:
Substrate
Name:
BDBM10999
Synonyms:
Benzenemethanamine CHEMBL522 phenylmethanamine
Type:
Small organic molecule
Emp. Form.:
C7H9N
Mol. Mass.:
107.1531
SMILES:
NCc1ccccc1
: