Target
Cannabinoid receptor 2
Ligand
BDBM221166
Substrate
Meas. Tech.
cAMP Assay
Temperature
310.15±n/a K
EC50
100.8±n/a nM
Comments
extracted
Citation
 Bendels, SGrether, UKimbara, ANettekoven, MRoever, SRogers-Evans, MSchaffter, ESchulz-Gasch, T Pyridine-2-amides useful as CB2 agonists US Patent  US9303012 Publication Date 4/5/2016 
Target
Name:
Cannabinoid receptor 2
Synonyms:
CANNABINOID CB2 CB2 CB2B CNR2_HUMAN Cannabinoid CB2 receptor Cannabinoid receptor 2 (CB2R) | hCB2
Type:
G Protein-Coupled Receptor (GPCR)
Mol. Mass.:
39690.94
Organism:
Homo sapiens (Human)
Description:
P34972
Residue:
360
  
Inhibitor
Name:
BDBM221166
Synonyms:
US9303012, 92
Type:
Small organic molecule
Emp. Form.:
C19H25N3O3
Mol. Mass.:
343.4201
SMILES:
NC(=O)[C@@H]1CCCCN1C(=O)c1ccc(C2CC2)c(OCC2CC2)n1
: