Target
Cannabinoid receptor 2
Ligand
BDBM221221
Substrate
Meas. Tech.
cAMP Assay
Temperature
310.15±n/a K
EC50
1167±n/a nM
Comments
extracted
Citation
 Bendels, SGrether, UKimbara, ANettekoven, MRoever, SRogers-Evans, MSchaffter, ESchulz-Gasch, T Pyridine-2-amides useful as CB2 agonists US Patent  US9303012 Publication Date 4/5/2016 
Target
Name:
Cannabinoid receptor 2
Synonyms:
CANNABINOID CB2 CB2 CB2B CNR2_HUMAN Cannabinoid CB2 receptor Cannabinoid receptor 2 (CB2R) | hCB2
Type:
G Protein-Coupled Receptor (GPCR)
Mol. Mass.:
39690.94
Organism:
Homo sapiens (Human)
Description:
P34972
Residue:
360
  
Inhibitor
Name:
BDBM221221
Synonyms:
US9303012, 147
Type:
Small organic molecule
Emp. Form.:
C16H17F5N4O3
Mol. Mass.:
408.3232
SMILES:
NC(=O)[C@@H]1CC(F)(F)CN1C(=O)c1ccc(N2CC(F)(F)C2)c(OCCF)n1
: