Target
Cannabinoid receptor 1
Ligand
BDBM221110
Substrate
Meas. Tech.
cAMP Assay
Temperature
310.15±n/a K
EC50
>10000±n/a nM
Comments
extracted
Citation
 Bendels, SGrether, UKimbara, ANettekoven, MRoever, SRogers-Evans, MSchaffter, ESchulz-Gasch, T Pyridine-2-amides useful as CB2 agonists US Patent  US9303012 Publication Date 4/5/2016 
Target
Name:
Cannabinoid receptor 1
Synonyms:
CANN6 CB-R CNR CNR1_HUMAN Cannabinoid receptor Cannabinoid receptor 1 (brain)
Type:
G Protein-Coupled Receptor (GPCR)
Mol. Mass.:
52868.96
Organism:
Homo sapiens (Human)
Description:
P21554
Residue:
472
  
Inhibitor
Name:
BDBM221110
Synonyms:
US9303012, 36
Type:
Small organic molecule
Emp. Form.:
C21H27F2N5O3
Mol. Mass.:
435.4676
SMILES:
Cc1nnc(CN(C(=O)c2ccc(N3CC(F)(F)C3)c(OCC3CC3)n2)C(C)(C)C)o1
: