Target
Cannabinoid receptor 1
Ligand
BDBM221112
Substrate
Meas. Tech.
cAMP Assay
Temperature
310.15±n/a K
EC50
>10000±n/a nM
Comments
extracted
Citation
 Bendels, SGrether, UKimbara, ANettekoven, MRoever, SRogers-Evans, MSchaffter, ESchulz-Gasch, T Pyridine-2-amides useful as CB2 agonists US Patent  US9303012 Publication Date 4/5/2016 
Target
Name:
Cannabinoid receptor 1
Synonyms:
CANN6 CB-R CNR CNR1_HUMAN Cannabinoid receptor Cannabinoid receptor 1 (brain)
Type:
G Protein-Coupled Receptor (GPCR)
Mol. Mass.:
52868.96
Organism:
Homo sapiens (Human)
Description:
P21554
Residue:
472
  
Inhibitor
Name:
BDBM221112
Synonyms:
US9303012, 38
Type:
Small organic molecule
Emp. Form.:
C19H23F2N3O3
Mol. Mass.:
379.401
SMILES:
FC1(F)CN(C1)c1ccc(nc1OCC1CC1)C(=O)N1CCCC11COC1
: