Target
Nuclear receptor ROR-gamma [258-518]
Ligand
BDBM221241
Substrate
Meas. Tech.
ThermoFluor® Assay
pH
7±n/a
Temperature
274.15±n/a K
Kd
150±n/a nM
Comments
extracted
Citation
 Leonard, KABarbay, KEdwards, JPKreutter, KDKummer, DAMaharoof, UNishimura, RUrbanski, MVenkatesan, HWang, AWolin, RLWoods, CRFourie, AXue, X Heteroaryl linked quinolinyl modulators of RORγt US Patent  US9303015 Publication Date 4/5/2016 
Target
Name:
Nuclear receptor ROR-gamma [258-518]
Synonyms:
NR1F3 RORG RZRG | Retinoic acid-related nuclear receptor gamma t (RORgammat)
Type:
Enzyme
Mol. Mass.:
30146.98
Organism:
Homo sapiens (Human)
Description:
Artificial Sequence Construct used in the Thermofluor Assay (Seq No: 4)
Residue:
261
  
Inhibitor
Name:
BDBM221241
Synonyms:
US9303015, 15a US9303015, 15c
Type:
Small organic molecule
Emp. Form.:
C27H21Cl2N3O3
Mol. Mass.:
506.38
SMILES:
COc1nc2ccc(cc2c(Cl)c1Oc1ccccc1)C(O)(c1cncn1C)c1ccc(Cl)cc1
: