Target
Nuclear receptor ROR-gamma [258-518]
Ligand
BDBM221289
Substrate
Meas. Tech.
ThermoFluor® Assay
pH
7±n/a
Temperature
274.15±n/a K
Kd
2.9±n/a nM
Comments
extracted
Citation
 Leonard, KABarbay, KEdwards, JPKreutter, KDKummer, DAMaharoof, UNishimura, RUrbanski, MVenkatesan, HWang, AWolin, RLWoods, CRFourie, AXue, X Heteroaryl linked quinolinyl modulators of RORγt US Patent  US9303015 Publication Date 4/5/2016 
Target
Name:
Nuclear receptor ROR-gamma [258-518]
Synonyms:
NR1F3 RORG RZRG | Retinoic acid-related nuclear receptor gamma t (RORgammat)
Type:
Enzyme
Mol. Mass.:
30146.98
Organism:
Homo sapiens (Human)
Description:
Artificial Sequence Construct used in the Thermofluor Assay (Seq No: 4)
Residue:
261
  
Inhibitor
Name:
BDBM221289
Synonyms:
US9303015, 22b | US9303015, 22c
Type:
Small organic molecule
Emp. Form.:
C27H15F3N6O2
Mol. Mass.:
512.4422
SMILES:
OC(c1cnc[nH]1)(c1ccc(nc1)C(F)(F)F)c1ccc2nc(C#N)c(Oc3ccccc3)c(C#N)c2c1
: