Target
Nuclear receptor ROR-gamma [258-518]
Ligand
BDBM221257
Substrate
Meas. Tech.
ThermoFluor® Assay
pH
7±n/a
Temperature
274.15±n/a K
Kd
14±n/a nM
Comments
extracted
Citation
 Leonard, KABarbay, KEdwards, JPKreutter, KDKummer, DAMaharoof, UNishimura, RUrbanski, MVenkatesan, HWang, AWolin, RLWoods, CRFourie, AXue, X Heteroaryl linked quinolinyl modulators of RORγt US Patent  US9303015 Publication Date 4/5/2016 
Target
Name:
Nuclear receptor ROR-gamma [258-518]
Synonyms:
NR1F3 RORG RZRG | Retinoic acid-related nuclear receptor gamma t (RORgammat)
Type:
Enzyme
Mol. Mass.:
30146.98
Organism:
Homo sapiens (Human)
Description:
Artificial Sequence Construct used in the Thermofluor Assay (Seq No: 4)
Residue:
261
  
Inhibitor
Name:
BDBM221257
Synonyms:
US9303015, 31a US9303015, 31c
Type:
Small organic molecule
Emp. Form.:
C30H22ClF3N6O2
Mol. Mass.:
590.983
SMILES:
Cn1cncc1C(O)(c1ccc(nc1)C(F)(F)F)c1ccc2nc(N3CCC3)c(Oc3ccc(cc3)C#N)c(Cl)c2c1
: