Target
Neuronal acetylcholine receptor subunit alpha-2/beta-4
Ligand
BDBM50428083
Substrate
Meas. Tech.
[3H]-Epibatidine Radioligand Binding Assay
pH
7.4±n/a
Temperature
277.15±n/a K
Ki
59000±n/a nM
Comments
extracted
Citation
 Xiao, YKellar, KJBrown, MLPaige, MALiu, YLevin, EDRezvani, AH 2,5-disubstituted-pyridyl nicotinic ligands, and methods of use thereof US Patent  US9303017 Publication Date 4/5/2016 
Target
Name:
Neuronal acetylcholine receptor subunit alpha-2/beta-4
Synonyms:
Neuronal acetylcholine receptor Alpha-2/Beta-4 Neuronal acetylcholine receptor; alpha2/beta4 | nAChR subtypes alpha2 beta4
Type:
Protein
Mol. Mass.:
Description:
Components:
This complex has 2 components.
Component 1
Name:
Neuronal acetylcholine receptor subunit alpha-2
Synonyms:
ACHA2_RAT Cholinergic, Nicotinic Alpha2Beta2 Chrna2
Type:
Enzyme
Mol. Mass.:
58597.25
Organism:
Rattus norvegicus (Rat)
Description:
P12389
Residue:
511
  
Component 2
Name:
Neuronal acetylcholine receptor subunit beta-4
Synonyms:
ACHB4_RAT Chrnb4 Neuronal acetylcholine receptor non-alpha-2 chain | Neuronal acetylcholine receptor protein beta-4 subunit
Type:
Enzyme
Mol. Mass.:
55863.89
Organism:
Rattus norvegicus (Rat)
Description:
P12392
Residue:
495
  
Inhibitor
Name:
BDBM50428083
Synonyms:
CHEMBL2323568 | US9303017, (S)-16, YL-1-169
Type:
Small organic molecule
Emp. Form.:
C17H24N2O
Mol. Mass.:
272.3853
SMILES:
CCCCC#Cc1cnc(C)c(OC[C@@H]2CCCN2)c1
: