Target
Orexin receptor type 2
Ligand
BDBM221426
Substrate
Meas. Tech.
In Vitro Assay
Temperature
310.15±n/a K
IC50
262±n/a nM
Comments
extracted
Citation
 Bolli, MBoss, CBrotschi, CGude, MHeidmann, BSifferlen, TWilliams, JT Pyrazole and imidazole derivatives useful as orexin antagonists US Patent  US9303023 Publication Date 4/5/2016 
Target
Name:
Orexin receptor type 2
Synonyms:
HCRTR2 OX2R_HUMAN Orexin receptor type 2 (OR-2) Orexin receptor type 2 (OX2R) Ox-2-R | Ox2-R
Type:
Protein
Mol. Mass.:
50710.53
Organism:
Homo sapiens (Human)
Description:
O43614
Residue:
444
  
Inhibitor
Name:
BDBM221426
Synonyms:
US9303023, 123
Type:
Small organic molecule
Emp. Form.:
C22H23N7O2
Mol. Mass.:
417.4637
SMILES:
Cc1cccc(c1)-c1ocnc1C(=O)Nc1cnn(CCNc2nc(C)cc(C)n2)c1
: