Target
Apoptosis regulator Bcl-2
Ligand
BDBM145089
Substrate
Meas. Tech.
Time Resolved-Fluorescence Resonance Energy Transfer (TR-FRET) Assay
Temperature
298.15±n/a K
Ki
1.703±n/a nM
Comments
extracted
Citation
 Bruncko, MDing, HDoherty, GAElmore, SWHasvold, LHexamer, LKunzer, ARMantei, RAPark, CSong, XSouers, AJSullivan, GMTao, ZWang, GTWang, LWang, XWendt, MD Apoptosis-inducing agents for the treatment of cancer and immune and autoimmune diseases US Patent  US9303025 Publication Date 4/5/2016 
Target
Name:
Apoptosis regulator Bcl-2
Synonyms:
Apoptosis regulator Bcl-2 Protein BCL-2 BCL2_HUMAN | Bcl-2 Protein
Type:
Homodimer or heterodimer
Mol. Mass.:
26269.11
Organism:
Homo sapiens (Human)
Description:
P10415
Residue:
239
  
Inhibitor
Name:
BDBM145089
Synonyms:
US8952157, 279 | US9303025, 279
Type:
Small organic molecule
Emp. Form.:
C43H50ClN7O7S
Mol. Mass.:
844.418
SMILES:
CC1(C)CCC(CN2CCN(CC2)c2ccc(C(=O)NS(=O)(=O)c3ccc(NCC4CCOCC4)c(c3)[N+]([O-])=O)c(Oc3cncc(N)c3)c2)=C(C1)c1ccc(Cl)cc1
: