Target
Metabotropic glutamate receptor 2
Ligand
BDBM50017271
Substrate
Meas. Tech.
mGlu Receptor In Vitro Assays
pH
7.3±n/a
Temperature
298.15±n/a K
EC50
208±36 nM
Comments
extracted
Citation
 Dhanya, RPSheffler, DJCosford, NDDahl, R Metabotropic glutamate receptor positive allosteric modulators (PAMS) and uses thereof US Patent  US10099993 Publication Date 10/16/2018 
Target
Name:
Metabotropic glutamate receptor 2
Synonyms:
GPRC1B GRM2_HUMAN Metabotropic glutamate receptor mGlu2 | metabotropic glutamate 2
Type:
Enzyme
Mol. Mass.:
95584.88
Organism:
Homo sapiens (Human)
Description:
Q14416
Residue:
872
  
Inhibitor
Name:
BDBM50017271
Synonyms:
CHEMBL3287726 | US10099993, Compound 75
Type:
Small organic molecule
Emp. Form.:
C24H29FO6
Mol. Mass.:
432.4819
SMILES:
Cc1c(O)c(ccc1OCCCCOc1ccc(F)c(c1)C(O)=O)C(=O)CC(C)(C)C
: