Target
Metabotropic glutamate receptor 3
Ligand
BDBM290508
Substrate
EC50
>10000±n/a nM
Citation
 Dhanya, RPSheffler, DJCosford, NDDahl, R Metabotropic glutamate receptor positive allosteric modulators (PAMS) and uses thereof US Patent  US10099993 Publication Date 10/16/2018 
Target
Name:
Metabotropic glutamate receptor 3
Synonyms:
GPRC1C GRM3_HUMAN metabotropic glutamate 3 metabotropic glutamate 3/1c
Type:
Enzyme Catalytic Domain
Mol. Mass.:
98889.09
Organism:
Homo sapiens (Human)
Description:
metabotropic glutamate 1c 0 HUMAN::Q14832
Residue:
879
  
Inhibitor
Name:
BDBM290508
Synonyms:
US10099993, Compound 89
Type:
Small organic molecule
Emp. Form.:
C25H33NO7
Mol. Mass.:
459.532
SMILES:
COc1ccc(cc1OCCCCOc1ccc(C(=O)CC(C)(C)C)c(O)c1C)C(=O)NO
: