Target
Metabotropic glutamate receptor 3
Ligand
BDBM290568
Substrate
EC50
203±1 nM
Citation
 Dhanya, RPSheffler, DJCosford, NDDahl, R Metabotropic glutamate receptor positive allosteric modulators (PAMS) and uses thereof US Patent  US10099993 Publication Date 10/16/2018 
Target
Name:
Metabotropic glutamate receptor 3
Synonyms:
GPRC1C GRM3_HUMAN metabotropic glutamate 3 metabotropic glutamate 3/1c
Type:
Enzyme Catalytic Domain
Mol. Mass.:
98889.09
Organism:
Homo sapiens (Human)
Description:
metabotropic glutamate 1c 0 HUMAN::Q14832
Residue:
879
  
Inhibitor
Name:
BDBM290568
Synonyms:
US10099993, Compound 149
Type:
Small organic molecule
Emp. Form.:
C26H27NO5
Mol. Mass.:
433.4963
SMILES:
Cc1c(OCc2ccnc(c2)-c2cccc(c2)C(O)=O)ccc(C(=O)CC(C)(C)C)c1O
: