Target
C-X-C chemokine receptor type 4
Ligand
BDBM221787
Substrate
Meas. Tech.
Calcium Mobilization Assay
Temperature
310.15±n/a K
IC50
217±n/a nM
Comments
extracted
Citation
 Clark, MPWagner, FFNatchus, MGDoroh, BCJohnson, TLTahirovic, YAWilson, LWiseman, JMSkudlarek, JWLockwood, MA Chemokine receptor modulators US Patent  US9314468 Publication Date 4/19/2016 
Target
Name:
C-X-C chemokine receptor type 4
Synonyms:
C-X-C chemokine receptor type 4 CD_antigen=CD184 CXCR-4 CXCR4_HUMAN Fusin LCR1 Leukocyte-derived seven transmembrane domain receptor SDF-1 receptor | Stromal cell-derived factor 1 receptor
Type:
Enzyme
Mol. Mass.:
39754.61
Organism:
Homo sapiens (Human)
Description:
P61073
Residue:
352
  
Inhibitor
Name:
BDBM221787
Synonyms:
US9314468, Table 7, Compound 74
Type:
Small organic molecule
Emp. Form.:
C33H31N5O2
Mol. Mass.:
529.6315
SMILES:
CN(Cc1nccc2c3ccccc3n(CCCN3C(=O)c4ccccc4C3=O)c12)[C@H]1CCCc2cccnc12
: