Target
C-X-C chemokine receptor type 4
Ligand
BDBM221829
Substrate
Meas. Tech.
Calcium Mobilization Assay
Temperature
310.15±n/a K
IC50
628±n/a nM
Comments
extracted
Citation
 Clark, MPWagner, FFNatchus, MGDoroh, BCJohnson, TLTahirovic, YAWilson, LWiseman, JMSkudlarek, JWLockwood, MA Chemokine receptor modulators US Patent  US9314468 Publication Date 4/19/2016 
Target
Name:
C-X-C chemokine receptor type 4
Synonyms:
C-X-C chemokine receptor type 4 CD_antigen=CD184 CXCR-4 CXCR4_HUMAN Fusin LCR1 Leukocyte-derived seven transmembrane domain receptor SDF-1 receptor | Stromal cell-derived factor 1 receptor
Type:
Enzyme
Mol. Mass.:
39754.61
Organism:
Homo sapiens (Human)
Description:
P61073
Residue:
352
  
Inhibitor
Name:
BDBM221829
Synonyms:
US9314468, Table 7, Compound 116
Type:
Small organic molecule
Emp. Form.:
C35H45N7O2
Mol. Mass.:
595.7775
SMILES:
CN1CCN(CCCN(Cc2nccc3c4ccccc4n(CC(=O)N4CCOCC4)c23)[C@H]2CCCc3cccnc23)CC1
: