Target
C-X-C chemokine receptor type 4
Ligand
BDBM221864
Substrate
Meas. Tech.
Inhibition Assay
IC50
5.5±n/a nM
Citation
 Clark, MPWagner, FFNatchus, MGDoroh, BCJohnson, TLTahirovic, YAWilson, LWiseman, JMSkudlarek, JWLockwood, MA Chemokine receptor modulators US Patent  US9314468 Publication Date 4/19/2016 
Target
Name:
C-X-C chemokine receptor type 4
Synonyms:
C-X-C chemokine receptor type 4 CD_antigen=CD184 CXCR-4 CXCR4_HUMAN Fusin LCR1 Leukocyte-derived seven transmembrane domain receptor SDF-1 receptor | Stromal cell-derived factor 1 receptor
Type:
Enzyme
Mol. Mass.:
39754.61
Organism:
Homo sapiens (Human)
Description:
P61073
Residue:
352
  
Inhibitor
Name:
BDBM221864
Synonyms:
US9314468, Table 8, Compound 2
Type:
Small organic molecule
Emp. Form.:
C28H31N5
Mol. Mass.:
437.5792
SMILES:
NCCCCN(Cc1nccc2c3ccccc3n(CC#C)c12)C1CCCc2cccnc12
: