Target
Muscarinic acetylcholine receptor M3
Ligand
BDBM221904
Substrate
Meas. Tech.
Muscarinic Receptor Binding Assay
IC50
1±n/a nM
Citation
 Prat Quinones, MFonquerna Pou, SPuig Duran, CLumeras Amador, WAiguade Bosch, JCaturla Jovaloyes, JF Cyclohexylamine derivatives having β2 adrenergic agonist and M3 muscarinic antagonist activities US Patent  US9315463 Publication Date 4/19/2016 
Target
Name:
Muscarinic acetylcholine receptor M3
Synonyms:
ACM3_HUMAN Cholinergic, muscarinic M3 Muscarinic receptor M3 | RecName: Full=Muscarinic acetylcholine receptor M3
Type:
Enzyme
Mol. Mass.:
66151.03
Organism:
Homo sapiens (Human)
Description:
P20309
Residue:
590
  
Inhibitor
Name:
BDBM221904
Synonyms:
US9315463, 15
Type:
Small organic molecule
Emp. Form.:
C39H43ClN4O8S2
Mol. Mass.:
795.364
SMILES:
COc1cc(NC(=O)CCCN[C@H]2CC[C@@H](CC2)OC(=O)C(O)(c2cccs2)c2cccs2)c(Cl)cc1CNC[C@H](O)c1ccc(O)c2[nH]c(=O)ccc12
: