Target
Sphingosine 1-phosphate receptor 1
Ligand
BDBM221931
Substrate
Meas. Tech.
GTPγS Binding Assay
pH
7.4±n/a
IC50
179±n/a nM
Citation
 Zhang, XWang, EGuo, JNiu, SDai, ZZheng, NJi, LWang, ZLiang, T Heterocyclic group contained amino-methanol derivative, and salt, synthetic method and use thereof US Patent  US9315492 Publication Date 4/19/2016 
Target
Name:
Sphingosine 1-phosphate receptor 1
Synonyms:
CHEDG1 Endothelial differentiation G-protein coupled receptor 1 S1P1 S1PR1_HUMAN Sphingosine 1-phosphate receptor Edg-1
Type:
Enzyme
Mol. Mass.:
42836.02
Organism:
Homo sapiens (Human)
Description:
P21453
Residue:
382
  
Inhibitor
Name:
BDBM221931
Synonyms:
US9315492, 21
Type:
Small organic molecule
Emp. Form.:
C30H33N3O3
Mol. Mass.:
483.6013
SMILES:
CC(C)Oc1ccc(cc1C)-c1nnc(o1)-c1ccc2CCC(CO)(Cc2c1)NCc1ccccc1
: