Target
Prostaglandin G/H synthase 2
Ligand
BDBM221999
Substrate
Meas. Tech.
COX-1/COX-2 Inhibition Colorimetric Assay
IC50
1430±n/a nM
Citation
 Abdellatif, KRFadaly, WA Design, synthesis, cyclooxygenase inhibition and biological evaluation of new 1,3,5-triaryl-4,5-dihydro-1H-pyrazole derivatives possessing amino/methanesulfonyl pharmacophore. Bioorg Chem 70:57-66 (2017)  
Target
Name:
Prostaglandin G/H synthase 2
Synonyms:
COX2 Cyclooxygenase-2 (COX-2) PTGS2 Prostaglandin G/H synthase (cyclooxygenase)
Type:
Protein
Mol. Mass.:
68976.98
Organism:
Ovis aries (Sheep)
Description:
Residue:
603
  
Inhibitor
Name:
BDBM221999
Synonyms:
4-[3-(4-Bromo-phenyl)-5-(4-chloro-phenyl)-4,5-dihydro-pyrazol-1-yl]-benzene-sulfonamide (10c)
Type:
Small organic molecule
Emp. Form.:
C21H17BrClN3O2S
Mol. Mass.:
490.801
SMILES:
NS(=O)(=O)c1ccc(cc1)N1N=C(CC1c1ccc(Cl)cc1)c1ccc(Br)cc1
: