Target
Prostaglandin G/H synthase 1
Ligand
BDBM221997
Substrate
Meas. Tech.
COX-1/COX-2 Inhibition Colorimetric Assay
IC50
7.52e+3±n/a nM
Citation
 Abdellatif, KRFadaly, WA Design, synthesis, cyclooxygenase inhibition and biological evaluation of new 1,3,5-triaryl-4,5-dihydro-1H-pyrazole derivatives possessing amino/methanesulfonyl pharmacophore. Bioorg Chem 70:57-66 (2017)  
Target
Name:
Prostaglandin G/H synthase 1
Synonyms:
COX1 Cyclooxygenase-1 (COX-1) PTGS1 | Prostaglandin G/H synthase (cyclooxygenase)
Type:
Protein
Mol. Mass.:
68868.60
Organism:
Ovis aries (Sheep)
Description:
Residue:
600
  
Inhibitor
Name:
BDBM221997
Synonyms:
4-[3-(4-Bromo-phenyl)-5-(3,4,5-trimethoxy-phenyl)-4,5-dihydropyrazol- 1-yl]-benzene-sulfonamide (10a)
Type:
Small organic molecule
Emp. Form.:
C24H24BrN3O5S
Mol. Mass.:
546.433
SMILES:
COc1cc(cc(OC)c1OC)C1CC(=NN1c1ccc(cc1)S(N)(=O)=O)c1ccc(Br)cc1
: