Target
Prostaglandin G/H synthase 2
Ligand
BDBM222033
Substrate
Meas. Tech.
COX Inhibition Assay
IC50
2.00e+4±n/a nM
Citation
 Rathore, ASudhakar, RAhsan, MJAli, ASubbarao, NJadav, SSUmar, SYar, MS In vivo anti-inflammatory activity and docking study of newly synthesized benzimidazole derivatives bearing oxadiazole and morpholine rings. Bioorg Chem 70:107-117 (2017)  
Target
Name:
Prostaglandin G/H synthase 2
Synonyms:
COX2 Cyclooxygenase 2 (COX-2) Cyclooxygenase-2 (COX-2 AA) Cyclooxygenase-2 (COX-2) PGH2_HUMAN PHS II Prostaglandin E synthase/G/H synthase 2 Prostaglandin-endoperoxide synthase 2
Type:
Enzyme
Mol. Mass.:
69003.89
Organism:
Homo sapiens (Human)
Description:
Recombinant Cox-2 provided by Cayman (Cayman Chemical Co.,Ann Arbor, MI).
Residue:
604
  
Inhibitor
Name:
BDBM222033
Synonyms:
2-(Morpholinomethyl)-1-((5-(4-nitrophenyl)-1,3,4-oxadiazol-2-yl)methyl)-1H-benzimidazole (5l)
Type:
Small organic molecule
Emp. Form.:
C21H20N6O4
Mol. Mass.:
420.4213
SMILES:
[O-][N+](=O)c1ccc(cc1)-c1nnc(Cn2c(CN3CCOCC3)nc3ccccc23)o1
: