Target
Prostaglandin G/H synthase 1
Ligand
BDBM222101
Substrate
Meas. Tech.
In Vitro Cyclooxygenase (COX) Inhibition Assay
IC50
1.65e+4±n/a nM
Citation
 Alsayed, SSElshemy, HAAbdelgawad, MAAbdel-Latif, MSAbdellatif, KR Design, synthesis and biological screening of some novel celecoxib and etoricoxib analogs with promising COX-2 selectivity, anti-inflammatory activity and gastric safety profile. Bioorg Chem 70:173-183 (2017)  
Target
Name:
Prostaglandin G/H synthase 1
Synonyms:
COX1 Cyclooxygenase-1 (COX-1) PTGS1 | Prostaglandin G/H synthase (cyclooxygenase)
Type:
Protein
Mol. Mass.:
68868.60
Organism:
Ovis aries (Sheep)
Description:
Residue:
600
  
Inhibitor
Name:
BDBM222101
Synonyms:
1-(4-Aminosulfonylphenyl)-5-(2-furyl)-3-(4-methanesulfonylaminophenyl)-4,5-dihydro-1H-pyrazole (6e)
Type:
Small organic molecule
Emp. Form.:
C20H20N4O5S2
Mol. Mass.:
460.527
SMILES:
CS(=O)(=O)Nc1ccc(cc1)C1=NN(C(C1)c1ccco1)c1ccc(cc1)S(N)(=O)=O
: