Target
Solute carrier family 22 member 12
Ligand
BDBM290482
Substrate
Meas. Tech.
hURAT1 Inhibition Assay
IC50
148±n/a nM
Citation
 Xu, ZZhang, NSun, QWu, T Condensed ring derivative, and preparation method, intermediate, pharmaceutical composition and use thereof US Patent  US10100016 Publication Date 10/16/2018 
Target
Name:
Solute carrier family 22 member 12
Synonyms:
OATL4 RST S22AC_HUMAN Solute carrier family 22 member 12 URAT1 Urate anion exchanger 1 (URAT1) | Uric Acid Transporter 1 (URAT1)
Type:
Enzyme
Mol. Mass.:
59638.65
Organism:
Homo sapiens (Human)
Description:
Q96S37
Residue:
553
  
Inhibitor
Name:
BDBM290482
Synonyms:
US10100016, Compound 46A
Type:
Small organic molecule
Emp. Form.:
C22H16N2O2S
Mol. Mass.:
372.44
SMILES:
C[C@@H](Cc1cc2cncc(-c3ccc(C#N)c4ccccc34)c2s1)C(O)=O
: