Target
Alkaline phosphatase, tissue-nonspecific isozyme
Ligand
BDBM222192
Substrate
Meas. Tech.
Alkaline Phosphatase Inhibition Assay
pH
9.8±n/a
Temperature
310.15±n/a K
IC50
5.1e+2± 41 nM
Comments
extracted
Citation
 Bhatti, HAKhatoon, MAl-Rashida, MBano, HIqbal, NZaib-Un-Nisa, nullYousuf, SKhan, KMHameed, AIqbal, J Facile dimethyl amino group triggered cyclic sulfonamides synthesis and evaluation as alkaline phosphatase inhibitors. Bioorg Chem 71:10-18 (2017)  
Target
Name:
Alkaline phosphatase, tissue-nonspecific isozyme
Synonyms:
ALPL Alkaline phosphatase liver/bone/kidney isozyme PPBT_BOVIN Tissue non-specific alkaline phosphatase (TNAP)
Type:
Protein
Mol. Mass.:
57195.60
Organism:
Bos taurus (Cattle)
Description:
P09487
Residue:
524
  
Inhibitor
Name:
BDBM222192
Synonyms:
6-(Dimethylamino)-3-(2',3',4'-trimethoxyphenyl)-2,3-dihydronaphtho[1,8-de][1,2]thiazine 1,1-dioxide (7n)
Type:
Small organic molecule
Emp. Form.:
C22H24N2O5S
Mol. Mass.:
428.501
SMILES:
COc1ccc(C2NS(=O)(=O)c3cccc4c(ccc2c34)N(C)C)c(OC)c1OC
: