Target
Beta-glucuronidase
Ligand
BDBM222208
Substrate
Meas. Tech.
β-Glucuronidase Assay
IC50
1.455e+4± 3.0e+2 nM
Citation
 Taha, MBaharudin, MSIsmail, NHSelvaraj, MSalar, UAlkadi, KAKhan, KM Synthesis and in silico studies of novel sulfonamides having oxadiazole ring: As ß-glucuronidase inhibitors. Bioorg Chem 71:86-96 (2017)  
Target
Name:
Beta-glucuronidase
Synonyms:
β-Glucuronidase Beta-G1 GUSB | beta-Glucuronidase (β-glucuronidase)
Type:
Protein
Mol. Mass.:
74736.05
Organism:
Homo sapiens (Human)
Description:
Residue:
651
  
Inhibitor
Name:
BDBM222208
Synonyms:
2,4-Dichloro-N'-(4-(5-(2-methoxyphenyl)-1,3,4-oxadiazol-2-yl)benzoyl)benzenesulfono-hydrazide (17)
Type:
Small organic molecule
Emp. Form.:
C22H16Cl2N4O5S
Mol. Mass.:
519.357
SMILES:
COc1ccccc1-c1nnc(o1)-c1ccc(cc1)C(=O)NNS(=O)(=O)c1ccc(Cl)cc1Cl
: